Target
Mineralocorticoid receptor
Ligand
BDBM50398065
Substrate
Meas. Tech.
ChEMBL_873663 (CHEMBL2188779)
Ki
0.40±n/a nM
Citation
 Piotrowski, DW Mineralocorticoid receptor antagonists for the treatment of hypertension and diabetic nephropathy. J Med Chem 55:7957-66 (2012)  
Target
Name:
Mineralocorticoid receptor
Synonyms:
MCR MLR NR3C2 | Nuclear receptor subfamily 3 group C member 2
Type:
Enzyme
Mol. Mass.:
107076.42
Organism:
Homo sapiens (Human)
Description:
P08235
Residue:
984
  
Inhibitor
Name:
BDBM50398065
Synonyms:
CHEMBL2181925
Type:
Small organic molecule
Emp. Form.:
C29H26FN3O3
Mol. Mass.:
483.5334
SMILES:
Fc1ccc2c(OCc3ccccc3\C2=C/c2ccc3n([C@H]4C[C@H]5COCCN5C4)c(=O)[nH]c3c2)c1
: