Target
Aurora kinase A
Ligand
BDBM50273571
Substrate
Meas. Tech.
ChEMBL_874447 (CHEMBL2184332)
IC50
11±n/a nM
Citation
 Elkins, JMSantaguida, SMusacchio, AKnapp, S Crystal structure of human aurora B in complex with INCENP and VX-680. J Med Chem 55:7841-8 (2012)  
Target
Name:
Aurora kinase A
Synonyms:
AIK ARK-1 AURA AURKA_HUMAN Aurora 2 Aurora kinase A (AURKA) Aurora kinase A (Aurora-2) Aurora/IPL1-related kinase 1 Breast tumor-amplified kinase IAK1 STK15 GN Serine/threonine kinase 15 Serine/threonine-protein kinase 6 Serine/threonine-protein kinase aurora-A aurora-2 | hARK1
Type:
Serine/threonine-protein kinase
Mol. Mass.:
45830.98
Organism:
Homo sapiens (Human)
Description:
O14965
Residue:
403
  
Inhibitor
Name:
BDBM50273571
Synonyms:
CHEMBL514409 N-(2-oxo-3-(phenyl(4-(piperidin-1-ylmethyl)phenylamino)methylene)indolin-5-yl)ethanesulfonamide | TCMDC-135395
Type:
Small organic molecule
Emp. Form.:
C29H32N4O3S
Mol. Mass.:
516.654
SMILES:
CCS(=O)(=O)Nc1ccc2NC(=O)C(C(=Nc3ccc(CN4CCCCC4)cc3)c3ccccc3)c2c1
: