Target
Beta-secretase 1
Ligand
BDBM50398475
Substrate
Meas. Tech.
ChEMBL_872757 (CHEMBL2185582)
IC50
1±n/a nM
Citation
 Ghosh, AKVenkateswara Rao, KYadav, NDAnderson, DDGavande, NHuang, XTerzyan, STang, J Structure-based design of highly selectiveß-secretase inhibitors: synthesis, biological evaluation, and protein-ligand X-ray crystal structure. J Med Chem 55:9195-207 (2012)  
Target
Name:
Beta-secretase 1
Synonyms:
ASP2 Aspartyl protease 2 BACE1 Beta-secretase (BACE) Beta-secretase 1 (BACE 1) Beta-secretase 1 (BACE1) Beta-site amyloid precursor protein cleaving enzyme 1 Memapsin-2 beta-Secretase (BACE-1) | beta-Secretase (BACE1)
Type:
Protein
Mol. Mass.:
55755.10
Organism:
Homo sapiens (Human)
Description:
P56817
Residue:
501
  
Inhibitor
Name:
BDBM50398475
Synonyms:
CHEMBL2179131
Type:
Small organic molecule
Emp. Form.:
C35H47N5O6S
Mol. Mass.:
665.843
SMILES:
CC(C)CNC(=O)[C@@H](NC[C@H](Cc1ccccc1)NC(=O)c1cc(cc(c1)C(=O)N[C@H](C)c1ccccc1)N(C)S(C)(=O)=O)[C@H](C)O
: