Target
Sucrase-isomaltase, intestinal
Ligand
BDBM18355
Substrate
Meas. Tech.
ChEMBL_878846 (CHEMBL2184154)
IC50
2700±n/a nM
Citation
 Kato, AHayashi, EMiyauchi, SAdachi, IImahori, TNatori, YYoshimura, YNash, RJShimaoka, HNakagome, IKoseki, JHirono, STakahata, H a-1-C-butyl-1,4-dideoxy-1,4-imino-l-arabinitol as a second-generation iminosugar-based orala-glucosidase inhibitor for improving postprandial hyperglycemia. J Med Chem 55:10347-62 (2012)  
Target
Name:
Sucrase-isomaltase, intestinal
Synonyms:
SUIS_RAT Sucrase-isomaltase | alpha-Glucosidase (α-Glucosidase)
Type:
Enzyme
Mol. Mass.:
210329.04
Organism:
Rattus norvegicus (Rat)
Description:
P23739
Residue:
1841
  
Inhibitor
Name:
BDBM18355
Synonyms:
(2R,3R,4R,5S)-1-butyl-2-(hydroxymethyl)piperidine-3,4,5-triol MIGLUSTAT US20230339856, Compound NB-DNJ | US9181184, 5
Type:
Small organic molecule
Emp. Form.:
C10H21NO4
Mol. Mass.:
219.278
SMILES:
CCCCN1C[C@H](O)[C@@H](O)[C@H](O)[C@H]1CO
: