Target
Acetylcholinesterase
Ligand
BDBM50400019
Substrate
Meas. Tech.
ChEMBL_877981 (CHEMBL2189047)
IC50
58700±n/a nM
Citation
 Yanovsky, IFinkin-Groner, EZaikin, ALerman, LShalom, HZeeli, SWeill, TGinsburg, INudelman, AWeinstock, M Carbamate derivatives of indolines as cholinesterase inhibitors and antioxidants for the treatment of Alzheimer's disease. J Med Chem 55:10700-15 (2012)  
Target
Name:
Acetylcholinesterase
Synonyms:
ACES_BOVIN Acetylcholinesterase (AChE) | Acetylcholinesterase precursor
Type:
Enzyme
Mol. Mass.:
67659.62
Organism:
Bos taurus (bovine)
Description:
Residue:
613
  
Inhibitor
Name:
BDBM50400019
Synonyms:
CHEMBL2177698
Type:
Small organic molecule
Emp. Form.:
C17H24N2O4
Mol. Mass.:
320.3835
SMILES:
CCN(C)C(=O)Oc1cccc2N(C)CC(CCC(=O)OC)c12
: