Target
Carboxylic ester hydrolase
Ligand
BDBM10750
Substrate
Meas. Tech.
ChEMBL_877980 (CHEMBL2189046)
IC50
480±n/a nM
Citation
 Yanovsky, IFinkin-Groner, EZaikin, ALerman, LShalom, HZeeli, SWeill, TGinsburg, INudelman, AWeinstock, M Carbamate derivatives of indolines as cholinesterase inhibitors and antioxidants for the treatment of Alzheimer's disease. J Med Chem 55:10700-15 (2012)  
Target
Name:
Carboxylic ester hydrolase
Synonyms:
BuChE Butyrylcholine esterase Butyrylcholinesterase (BChE) Butyrylcholinesterase (EqBuChE) butyrylcholinesterase precursor
Type:
Protein
Mol. Mass.:
68842.83
Organism:
Equus caballus (Horse)
Description:
Q9N1N9
Residue:
602
  
Inhibitor
Name:
BDBM10750
Synonyms:
(3R)-3-(prop-2-yn-1-ylamino)-2,3-dihydro-1H-inden-5-yl N-ethyl-N-methylcarbamate hydrochloride Aminoindan deriv. (R)18b.HCl R-CPAI
Type:
Small organic molecule
Emp. Form.:
C16H20N2O2
Mol. Mass.:
272.3422
SMILES:
CCN(C)C(=O)Oc1ccc2CC[C@@H](NCC#C)c2c1
: