Target
Carboxylic ester hydrolase
Ligand
BDBM50400033
Substrate
Meas. Tech.
ChEMBL_877980 (CHEMBL2189046)
IC50
66800±n/a nM
Citation
 Yanovsky, IFinkin-Groner, EZaikin, ALerman, LShalom, HZeeli, SWeill, TGinsburg, INudelman, AWeinstock, M Carbamate derivatives of indolines as cholinesterase inhibitors and antioxidants for the treatment of Alzheimer's disease. J Med Chem 55:10700-15 (2012)  
Target
Name:
Carboxylic ester hydrolase
Synonyms:
BuChE Butyrylcholine esterase Butyrylcholinesterase (BChE) Butyrylcholinesterase (EqBuChE) butyrylcholinesterase precursor
Type:
Protein
Mol. Mass.:
68842.83
Organism:
Equus caballus (Horse)
Description:
Q9N1N9
Residue:
602
  
Inhibitor
Name:
BDBM50400033
Synonyms:
CHEMBL2177711
Type:
Small organic molecule
Emp. Form.:
C19H28N2O4
Mol. Mass.:
348.4366
SMILES:
CCCCN(C)C(=O)Oc1ccc2C(CCC(=O)OC)CN(C)c2c1
: