Target
D(2) dopamine receptor
Ligand
BDBM50115277
Substrate
Meas. Tech.
ChEMBL_880031 (CHEMBL2213380)
Ki
59±n/a nM
Citation
 Gogoi, SBiswas, SModi, GAntonio, TReith, MEDutta, AK Novel bivalent ligands for D2/D3 dopamine receptors: Significant co-operative gain in D2 affinity and potency. ACS Med Chem Lett 3:991-996 (2012)  
Target
Name:
D(2) dopamine receptor
Synonyms:
DOPAMINE D2 DOPAMINE D2 Short Dopamine D2 receptor Drd2
Type:
G Protein-Coupled Receptor (GPCR)
Mol. Mass.:
50931.60
Organism:
Rattus norvegicus (rat)
Description:
P61169
Residue:
444
  
Inhibitor
Name:
BDBM50115277
Synonyms:
(2R,3R)-6-Dipropylamino-5,6,7,8-tetrahydro-naphthalen-1-ol (2S)-6-Dipropylamino-5,6,7,8-tetrahydro-naphthalen-1-ol (S)-(-)-5-hydroxy-2-(N,N-di-n-propylamino)tetralin (S)-6-Dipropylamino-5,6,7,8-tetrahydro-naphthalen-1-ol.HCl CHEMBL269004
Type:
Small organic molecule
Emp. Form.:
C16H25NO
Mol. Mass.:
247.3758
SMILES:
CCCN(CCC)[C@H]1CCc2c(O)cccc2C1
: