Target
Nociceptin receptor
Ligand
BDBM50400872
Substrate
Meas. Tech.
ChEMBL_880210 (CHEMBL2215339)
Ki
0.15±n/a nM
Citation
 Pike, VWRash, KSChen, ZPedregal, CStatnick, MAKimura, YHong, JZoghbi, SSFujita, MToledo, MADiaz, NGackenheimer, SLTauscher, JTBarth, VNInnis, RB Synthesis and evaluation of radioligands for imaging brain nociceptin/orphanin FQ peptide (NOP) receptors with positron emission tomography. J Med Chem 54:2687-700 (2011)  
Target
Name:
Nociceptin receptor
Synonyms:
KOR-3 Mu-type opioid receptor (Mu) Nociceptin Receptor (ORL1 Receptor) Nociceptin receptor (ORL-1) Nociceptin/Orphanin FQ, NOP receptor OPIATE ORL-1 OPRL1 protein ORL1 Opioid receptor like-1 Orphanin FQ receptor (ORL1) | P41146
Type:
G Protein-Coupled Receptor (GPCR)
Mol. Mass.:
40702.87
Organism:
Homo sapiens (Human)
Description:
P41146
Residue:
370
  
Inhibitor
Name:
BDBM50400872
Synonyms:
CHEMBL2088033
Type:
Small organic molecule
Emp. Form.:
C22H26F2N2O2S
Mol. Mass.:
420.516
SMILES:
CNC(=O)[C@H](CN1CCC2(CC1)OCCc1cc(F)sc21)Cc1ccccc1F
: