Target
Thyroid hormone receptor alpha
Ligand
BDBM50401076
Substrate
Meas. Tech.
ChEMBL_883198 (CHEMBL2212124)
Ki
12500±n/a nM
Citation
 Joharapurkar, AADhote, VVJain, MR Selective thyromimetics using receptor and tissue selectivity approaches: prospects for dyslipidemia. J Med Chem 55:5649-75 (2012)  
Target
Name:
Thyroid hormone receptor alpha
Synonyms:
C-erbA-alpha EAR7 NR1A1 THA_HUMAN THRA1 Thyroid Hormone Receptor (TR-alpha) Thyroid hormone receptor alpha c-erbA-1
Type:
Receptor
Mol. Mass.:
54818.00
Organism:
Homo sapiens (Human)
Description:
Recombinant hThR was obtained from nuclear extracts from SF9 cells infected with baculovirus vectors encoding for ThRalpha 1.
Residue:
490
  
Inhibitor
Name:
BDBM50401076
Synonyms:
CHEMBL457748
Type:
Small organic molecule
Emp. Form.:
C28H32ClO5P
Mol. Mass.:
514.977
SMILES:
CC(C)c1cc(Cc2c(C)cc(OC[P@@]3(=O)OCC[C@H](O3)c3cccc(Cl)c3)cc2C)ccc1O
: