Target
Cytochrome P450 2C19
Ligand
BDBM50401154
Substrate
Meas. Tech.
ChEMBL_881487 (CHEMBL2214474)
IC50
4200±n/a nM
Citation
 Gomaa, MSBridgens, CEIllingworth, NAVeal, GJRedfern, CPBrancale, AArmstrong, JLSimons, C Novel retinoic acid 4-hydroxylase (CYP26) inhibitors based on a 3-(1H-imidazol- and triazol-1-yl)-2,2-dimethyl-3-(4-(phenylamino)phenyl)propyl scaffold. Bioorg Med Chem 20:4201-7 (2012)  
Target
Name:
Cytochrome P450 2C19
Synonyms:
(R)-limonene 6-monooxygenase (S)-limonene 7-monooxygenase CYP2C19 CYPIIC19 Cytochrome P450 2C19 [I331V] Cytochrome P450-254C Mephenytoin 4-hydroxylase P450-254C
Type:
Enzyme
Mol. Mass.:
55935.47
Organism:
Homo sapiens (Human)
Description:
P33261
Residue:
490
  
Inhibitor
Name:
BDBM50401154
Synonyms:
CHEMBL2205775
Type:
Small organic molecule
Emp. Form.:
C20H22N4O2
Mol. Mass.:
350.4143
SMILES:
COC(=O)C(C)(C)C(c1ccc(Nc2ccccc2)cc1)n1cncn1
: