Target
Cytochrome P450 2C9
Ligand
BDBM50401154
Substrate
Meas. Tech.
ChEMBL_881488 (CHEMBL2214475)
IC50
9100±n/a nM
Citation
 Gomaa, MSBridgens, CEIllingworth, NAVeal, GJRedfern, CPBrancale, AArmstrong, JLSimons, C Novel retinoic acid 4-hydroxylase (CYP26) inhibitors based on a 3-(1H-imidazol- and triazol-1-yl)-2,2-dimethyl-3-(4-(phenylamino)phenyl)propyl scaffold. Bioorg Med Chem 20:4201-7 (2012)  
Target
Name:
Cytochrome P450 2C9
Synonyms:
(R)-limonene 6-monooxygenase CP2C9_HUMAN CYP2C9 Cytochrome P450 2C9 (CYP2C9 ) P-450MP P450 PB-1 | S-mephenytoin 4-hydroxylase
Type:
Enzyme
Mol. Mass.:
55636.33
Organism:
Homo sapiens (Human)
Description:
P11712
Residue:
490
  
Inhibitor
Name:
BDBM50401154
Synonyms:
CHEMBL2205775
Type:
Small organic molecule
Emp. Form.:
C20H22N4O2
Mol. Mass.:
350.4143
SMILES:
COC(=O)C(C)(C)C(c1ccc(Nc2ccccc2)cc1)n1cncn1
: