Target
Cytochrome P450 3A4
Ligand
BDBM50401154
Substrate
Meas. Tech.
ChEMBL_881490 (CHEMBL2214477)
IC50
200±n/a nM
Citation
 Gomaa, MSBridgens, CEIllingworth, NAVeal, GJRedfern, CPBrancale, AArmstrong, JLSimons, C Novel retinoic acid 4-hydroxylase (CYP26) inhibitors based on a 3-(1H-imidazol- and triazol-1-yl)-2,2-dimethyl-3-(4-(phenylamino)phenyl)propyl scaffold. Bioorg Med Chem 20:4201-7 (2012)  
Target
Name:
Cytochrome P450 3A4
Synonyms:
Albendazole monooxygenase CP3A4_HUMAN CYP3A4 CYPIIIA4 Cytochrome P450 3A4 (CYP3A4) Nifedipine oxidase Taurochenodeoxycholate 6-alpha-hydroxylase
Type:
Enzyme
Mol. Mass.:
57349.57
Organism:
Homo sapiens (Human)
Description:
Residue:
503
  
Inhibitor
Name:
BDBM50401154
Synonyms:
CHEMBL2205775
Type:
Small organic molecule
Emp. Form.:
C20H22N4O2
Mol. Mass.:
350.4143
SMILES:
COC(=O)C(C)(C)C(c1ccc(Nc2ccccc2)cc1)n1cncn1
: