Target
Cytochrome P450 1A2
Ligand
BDBM50401154
Substrate
Meas. Tech.
ChEMBL_881489 (CHEMBL2214476)
IC50
8500±n/a nM
Citation
 Gomaa, MSBridgens, CEIllingworth, NAVeal, GJRedfern, CPBrancale, AArmstrong, JLSimons, C Novel retinoic acid 4-hydroxylase (CYP26) inhibitors based on a 3-(1H-imidazol- and triazol-1-yl)-2,2-dimethyl-3-(4-(phenylamino)phenyl)propyl scaffold. Bioorg Med Chem 20:4201-7 (2012)  
Target
Name:
Cytochrome P450 1A2
Synonyms:
CP1A2_HUMAN CYPIA2 Cytochrome P(3)450 Cytochrome P450 1A2 (CYP1A2) Cytochrome P450-P3
Type:
Enzyme
Mol. Mass.:
58423.38
Organism:
Homo sapiens (Human)
Description:
P05177
Residue:
516
  
Inhibitor
Name:
BDBM50401154
Synonyms:
CHEMBL2205775
Type:
Small organic molecule
Emp. Form.:
C20H22N4O2
Mol. Mass.:
350.4143
SMILES:
COC(=O)C(C)(C)C(c1ccc(Nc2ccccc2)cc1)n1cncn1
: