Target
E3 ubiquitin-protein ligase XIAP
Ligand
BDBM50401480
Substrate
Meas. Tech.
ChEMBL_884121 (CHEMBL2216051)
IC50
3.3±n/a nM
Citation
 Lecis, DMastrangelo, EBelvisi, LBolognesi, MCivera, MCossu, FDe Cesare, MDelia, DDrago, CManenti, GManzoni, LMilani, MMoroni, EPerego, PPotenza, DRizzo, VScavullo, CScolastico, CServida, FVasile, FSeneci, P Dimeric Smac mimetics/IAP inhibitors as in vivo-active pro-apoptotic agents. Part II: Structural and biological characterization. Bioorg Med Chem 20:6709-23 (2012)  
Target
Name:
E3 ubiquitin-protein ligase XIAP
Synonyms:
API3 E3 ubiquitin-protein ligase XIAP Inhibitor of apoptosis protein 3 X-linked inhibitor of apoptosis XIAP | XIAP_HUMAN
Type:
Protein
Mol. Mass.:
56685.27
Organism:
Homo sapiens (Human)
Description:
P98170
Residue:
497
  
Inhibitor
Name:
BDBM50401480
Synonyms:
CHEMBL2204571
Type:
Small organic molecule
Emp. Form.:
C46H60N14O6S2
Mol. Mass.:
969.189
SMILES:
CN[C@@H](C)C(=O)N[C@@H]([C@H](C)OCC#CC#CCO[C@@H](C)[C@H](NC(=O)[C@H](C)NC)C(=O)N1CCC[C@H]1Cn1nnnc1Sc1ccccc1)C(=O)N1CCC[C@H]1Cn1nnnc1Sc1ccccc1
: