Target
E3 ubiquitin-protein ligase XIAP
Ligand
BDBM50401487
Substrate
Meas. Tech.
ChEMBL_884121 (CHEMBL2216051)
IC50
3.2±n/a nM
Citation
 Lecis, DMastrangelo, EBelvisi, LBolognesi, MCivera, MCossu, FDe Cesare, MDelia, DDrago, CManenti, GManzoni, LMilani, MMoroni, EPerego, PPotenza, DRizzo, VScavullo, CScolastico, CServida, FVasile, FSeneci, P Dimeric Smac mimetics/IAP inhibitors as in vivo-active pro-apoptotic agents. Part II: Structural and biological characterization. Bioorg Med Chem 20:6709-23 (2012)  
Target
Name:
E3 ubiquitin-protein ligase XIAP
Synonyms:
API3 E3 ubiquitin-protein ligase XIAP Inhibitor of apoptosis protein 3 X-linked inhibitor of apoptosis XIAP | XIAP_HUMAN
Type:
Protein
Mol. Mass.:
56685.27
Organism:
Homo sapiens (Human)
Description:
P98170
Residue:
497
  
Inhibitor
Name:
BDBM50401487
Synonyms:
CHEMBL2204578
Type:
Small organic molecule
Emp. Form.:
C73H94N10O8
Mol. Mass.:
1239.5897
SMILES:
CC[C@H](NC)C(=O)N[C@H]1[C@@H](CNC(=O)CCCCCC#CC#CCCCCC(=O)NC[C@H]2CC[C@H]3CC[C@H](N3C(=O)[C@H]2NC(=O)[C@H](CC)NC)C(=O)NC(c2ccccc2)c2ccccc2)CC[C@H]2CC[C@H](N2C1=O)C(=O)NC(c1ccccc1)c1ccccc1
: