Target
Procathepsin L
Ligand
BDBM50401763
Substrate
Meas. Tech.
ChEMBL_885154 (CHEMBL2213245)
IC50
1000±n/a nM
Citation
 Moss, NXiong, ZBurke, MCogan, DGao, DAHaverty, KHeim-Riether, AHickey, ERNagaraja, RNetherton, MO'Shea, KRamsden, PSchwartz, RShih, DTWard, YYoung, EZhang, Q Exploration of cathepsin S inhibitors characterized by a triazole P1-P2 amide replacement. Bioorg Med Chem Lett 22:7189-93 (2012)  
Target
Name:
Procathepsin L
Synonyms:
CATL1_HUMAN CTSL CTSL1 Cathepsin L Cathepsin L1 heavy chain MEP cathepsin L preproprotein
Type:
Enzyme
Mol. Mass.:
37557.19
Organism:
Homo sapiens (Human)
Description:
Purchased from Calbiochem (San Diego, CA).
Residue:
333
  
Inhibitor
Name:
BDBM50401763
Synonyms:
CHEMBL2207565
Type:
Small organic molecule
Emp. Form.:
C18H23N5OS
Mol. Mass.:
357.473
SMILES:
C[C@H]1CC[C@@H](CC1)[C@](C)(NC(=O)c1ccsc1)c1cn(CC#N)nn1
: