Target
D(3) dopamine receptor
Ligand
BDBM50401947
Substrate
Meas. Tech.
ChEMBL_886470 (CHEMBL2214281)
Ki
160±n/a nM
Citation
 Löber, SHübner, HBuschauer, ASanna, FArgiolas, AMelis, MRGmeiner, P Novel azulene derivatives for the treatment of erectile dysfunction. Bioorg Med Chem Lett 22:7151-4 (2012)  
Target
Name:
D(3) dopamine receptor
Synonyms:
DOPAMINE D3 DRD3_HUMAN Dopamine D3 receptor (D3) Dopamine receptor Dopamine receptor D3
Type:
Mol. Mass.:
44243.43
Organism:
Homo sapiens (Human)
Description:
Residue:
400
  
Inhibitor
Name:
BDBM50401947
Synonyms:
CHEMBL2207638
Type:
Small organic molecule
Emp. Form.:
C28H35N3O
Mol. Mass.:
429.597
SMILES:
COc1ccccc1N1CCN(Cc2cc(CN3CCCCC3)c3cccccc23)CC1
: