Target
Indoleamine 2,3-dioxygenase 1
Ligand
BDBM50402289
Substrate
Meas. Tech.
ChEMBL_885589 (CHEMBL2210858)
IC50
>100000±n/a nM
Citation
 Bakmiwewa, SMFatokun, AATran, APayne, RJHunt, NHBall, HJ Identification of selective inhibitors of indoleamine 2,3-dioxygenase 2. Bioorg Med Chem Lett 22:7641-6 (2012)  
Target
Name:
Indoleamine 2,3-dioxygenase 1
Synonyms:
I23O1_MOUSE Ido Indo | Indoleamine-pyrrole 2,3-dioxygenase
Type:
PROTEIN
Mol. Mass.:
45639.39
Organism:
Mus musculus
Description:
ChEMBL_1452149
Residue:
407
  
Inhibitor
Name:
BDBM50402289
Synonyms:
TENATOPRAZOLE
Type:
Small organic molecule
Emp. Form.:
C16H18N4O3S
Mol. Mass.:
346.404
SMILES:
COc1ccc2[nH]c(nc2n1)S(=O)Cc1ncc(C)c(OC)c1C
: