Target
Amine oxidase [flavin-containing] A
Ligand
BDBM50402320
Substrate
Meas. Tech.
ChEMBL_885770 (CHEMBL2213281)
IC50
708±n/a nM
Citation
 Mostert, SMentz, WPetzer, ABergh, JJPetzer, JP Inhibition of monoamine oxidase by 8-[(phenylethyl)sulfanyl]caffeine analogues. Bioorg Med Chem 20:7040-50 (2012)  
Target
Name:
Amine oxidase [flavin-containing] A
Synonyms:
AOFA_HUMAN MAO-A Monoamine oxidase Monoamine oxidase type A (MAO A) Monoamine oxidase type A (MAOA)
Type:
Protein
Mol. Mass.:
59689.53
Organism:
Homo sapiens (Human)
Description:
P21397
Residue:
527
  
Inhibitor
Name:
BDBM50402320
Synonyms:
CHEMBL2206103
Type:
Small organic molecule
Emp. Form.:
C17H19ClN4O2S
Mol. Mass.:
378.876
SMILES:
Cn1c(SCCCc2ccc(Cl)cc2)nc2n(C)c(=O)n(C)c(=O)c12
: