Target
Neuropeptide FF receptor 2
Ligand
BDBM50402446
Substrate
Meas. Tech.
ChEMBL_886539 (CHEMBL2215248)
Ki
425±n/a nM
Citation
 Gealageas, RSchneider, SHumbert, JPBertin, ISchmitt, MLaboureyras, EDugave, CMollereau, CSimonnet, GBourguignon, JJSimonin, FBihel, F Development of sub-nanomolar dipeptidic ligands of neuropeptide FF receptors. Bioorg Med Chem Lett 22:7471-4 (2012)  
Target
Name:
Neuropeptide FF receptor 2
Synonyms:
G-protein coupled receptor 74 GPR74 NPFF2_HUMAN NPGPR Neuropeptide G-protein coupled receptor
Type:
Enzyme Catalytic Domain
Mol. Mass.:
60293.78
Organism:
Homo sapiens (Human)
Description:
NPFF2 0 HUMAN::Q9Y5X5
Residue:
522
  
Inhibitor
Name:
BDBM50402446
Synonyms:
CHEMBL2208316
Type:
Small organic molecule
Emp. Form.:
C23H30N6O3
Mol. Mass.:
438.5227
SMILES:
[#7]\[#6](-[#7])=[#7]\[#6]-[#6]-[#6]-[#6@@H](-[#7]-[#6](=O)-[#6]-c1ccccc1)-[#6](=O)-[#7]-[#6@@H](-[#6]-c1ccccc1)-[#6](-[#7])=O
: