Target
Carnitine O-palmitoyltransferase 1, liver isoform
Ligand
BDBM50403031
Substrate
Meas. Tech.
ChEMBL_887463 (CHEMBL2217072)
IC50
2400±n/a nM
Citation
 Ceccarelli, SMChomienne, OGubler, MArduini, A Carnitine palmitoyltransferase (CPT) modulators: a medicinal chemistry perspective on 35 years of research. J Med Chem 54:3109-52 (2011)  
Target
Name:
Carnitine O-palmitoyltransferase 1, liver isoform
Synonyms:
CPT I CPT1-L CPT1A_HUMAN Carnitine O-palmitoyltransferase I, liver isoform
Type:
PROTEIN
Mol. Mass.:
88389.31
Organism:
Homo sapiens (Human)
Description:
ChEMBL_887463
Residue:
773
  
Inhibitor
Name:
BDBM50403031
Synonyms:
CHEMBL2216771
Type:
Small organic molecule
Emp. Form.:
C18H14O5S
Mol. Mass.:
342.366
SMILES:
OC(=O)C(=O)c1ccc(OCCOc2ccc3ccccc3c2)s1
: