Target
Growth hormone-releasing hormone receptor
Ligand
BDBM50403629
Substrate
Meas. Tech.
ChEBML_193173
EC50
1.9±n/a nM
Citation
 Tata, JRLu, ZJacks, TMSchleim, KDCheng, KWei, LChan, WWButler, BTsou, NLeung, KChiu, SHickey, GSmith, RGPatchett, AA The design and synthesis of orally active short duration spiroindane growth hormone secretagogues Bioorg Med Chem Lett 7:2319-2324 (1997)    Article 
Target
Name:
Growth hormone-releasing hormone receptor
Synonyms:
GHRH receptor GRF receptor Grfr
Type:
PROTEIN
Mol. Mass.:
51523.38
Organism:
Rattus norvegicus
Description:
ChEMBL_193173
Residue:
464
  
Inhibitor
Name:
BDBM50403629
Synonyms:
CHEMBL553478
Type:
Small organic molecule
Emp. Form.:
C30H39N3O4
Mol. Mass.:
505.6484
SMILES:
CC(C)(N)C(=O)N[C@H](CCCc1ccccc1)C(=O)N1CCC2(C[C@@H](CC(O)=O)c3ccccc23)CC1
: