Target
Growth hormone-releasing hormone receptor
Ligand
BDBM50049481
Substrate
Meas. Tech.
ChEBML_193173
EC50
60±n/a nM
Citation
 Tata, JRLu, ZJacks, TMSchleim, KDCheng, KWei, LChan, WWButler, BTsou, NLeung, KChiu, SHickey, GSmith, RGPatchett, AA The design and synthesis of orally active short duration spiroindane growth hormone secretagogues Bioorg Med Chem Lett 7:2319-2324 (1997)    Article 
Target
Name:
Growth hormone-releasing hormone receptor
Synonyms:
GHRH receptor GRF receptor Grfr
Type:
PROTEIN
Mol. Mass.:
51523.38
Organism:
Rattus norvegicus
Description:
ChEMBL_193173
Residue:
464
  
Inhibitor
Name:
BDBM50049481
Synonyms:
(R)-N-(1-((2'-(2H-tetrazol-5-yl)biphenyl-4-yl)methyl)-2-oxo-2,3,4,5-tetrahydro-1H-benzo[b]azepin-3-yl)-3-amino-3-methylbutanamide 3-Amino-3-methyl-N-{2-oxo-1-[2'-(1H-tetrazol-5-yl)-biphenyl-4-ylmethyl]-2,3,4,5-tetrahydro-1H-benzo[b]azepin-3-yl}-butyramide Arg-Pro-Lys-Pro-Phe-Trp-Leu L-692429
Type:
Small organic molecule
Emp. Form.:
C29H31N7O2
Mol. Mass.:
509.6021
SMILES:
CC(C)(N)CC(=O)N[C@@H]1CCc2ccccc2N(Cc2ccc(cc2)-c2ccccc2-c2nnn[nH]2)C1=O
: