Target
Growth hormone-releasing hormone receptor
Ligand
BDBM50403638
Substrate
Meas. Tech.
ChEBML_193173
EC50
1±n/a nM
Citation
 Tata, JRLu, ZJacks, TMSchleim, KDCheng, KWei, LChan, WWButler, BTsou, NLeung, KChiu, SHickey, GSmith, RGPatchett, AA The design and synthesis of orally active short duration spiroindane growth hormone secretagogues Bioorg Med Chem Lett 7:2319-2324 (1997)    Article 
Target
Name:
Growth hormone-releasing hormone receptor
Synonyms:
GHRH receptor GRF receptor Grfr
Type:
PROTEIN
Mol. Mass.:
51523.38
Organism:
Rattus norvegicus
Description:
ChEMBL_193173
Residue:
464
  
Inhibitor
Name:
BDBM50403638
Synonyms:
CHEMBL538008
Type:
Small organic molecule
Emp. Form.:
C32H43N3O4
Mol. Mass.:
533.7015
SMILES:
CCOC(=O)C[C@H]1CC2(CCN(CC2)C(=O)[C@@H](CCCc2ccccc2)NC(=O)C(C)(C)N)c2ccccc12
: