Target
ATP-dependent translocase ABCB1
Ligand
BDBM50403690
Substrate
Meas. Tech.
ChEMBL_151382 (CHEMBL758145)
IC50
24000±n/a nM
Citation
 O'Connell, CESalvato, KAMeng, ZLittlefield, BASchwartz, CE Synthesis and evaluation of hapalosin and analogs as MDR-reversing agents. Bioorg Med Chem Lett 9:1541-6 (1999)  
Target
Name:
ATP-dependent translocase ABCB1
Synonyms:
ABCB1 MDR1_HUMAN Multidrug resistance protein 1 P-glycoprotein (P-gp) PGY1
Type:
Protein
Mol. Mass.:
141503.50
Organism:
Homo sapiens (Human)
Description:
P08183
Residue:
1280
  
Inhibitor
Name:
BDBM50403690
Synonyms:
CHEMBL35924
Type:
Small organic molecule
Emp. Form.:
C27H41NO6
Mol. Mass.:
475.6175
SMILES:
CCCCCCC[C@@H]1CC(=O)O[C@@H](C(C)C)C(=O)N(C)[C@@H](Cc2ccccc2)[C@H](O)CC(=O)O1
: