Target
Neuronal acetylcholine receptor subunit alpha-4/beta-2
Ligand
BDBM50088649
Substrate
Meas. Tech.
ChEMBL_143710 (CHEMBL857696)
IC50
940±n/a nM
Citation
 Lee, JDavis, CBRivero, RAReitz, ABShank, RP Synthesis and structure-activity relationship of novel pyridyl ethers for the nicotinic acetylcholine receptor. Bioorg Med Chem Lett 10:1063-6 (2000)  
Target
Name:
Neuronal acetylcholine receptor subunit alpha-4/beta-2
Synonyms:
Neuronal acetylcholine receptor alpha4/beta2 Neuronal acetylcholine receptor; alpha4/beta2
Type:
Mol. Mass.:
Description:
Components:
This complex has 0 components.
Component 1
Name:
Neuronal acetylcholine receptor subunit alpha-4
Synonyms:
ACHA4_RAT Cholinergic, Nicotinic Alpha4Beta2 Chrna4 Neuronal acetylcholine receptor (alpha4beta2 nAChR) Neuronal acetylcholine receptor subunit alpha 4 beta 2 | Neuronal acetylcholine receptor subunit alpha-4
Type:
Enzyme
Mol. Mass.:
70196.44
Organism:
Rattus norvegicus (Rat)
Description:
P09483
Residue:
630
  
Component 2
Name:
Neuronal acetylcholine receptor subunit beta-2
Synonyms:
ACHB2_RAT Chrnb2 Neuronal acetylcholine receptor non-alpha-1 chain
Type:
Enzyme
Mol. Mass.:
56910.32
Organism:
Rattus norvegicus (Rat)
Description:
P12390
Residue:
500
  
Inhibitor
Name:
BDBM50088649
Synonyms:
3-(3-Chloro-phenyl)-5-((R)-pyrrolidin-3-yloxy)-pyridine | CHEMBL10173
Type:
Small organic molecule
Emp. Form.:
C15H15ClN2O
Mol. Mass.:
274.745
SMILES:
Clc1cccc(c1)-c1cncc(O[C@@H]2CCNC2)c1
: