Target
D(2) dopamine receptor
Ligand
BDBM50404047
Substrate
Meas. Tech.
ChEBML_60942
Ki
48±n/a nM
Citation
 González-Gómez, JCSantana, LUriarte, EBrea, JVillazón, MLoza, MIDe Luca, MRivas, MEMontenegro, GYFontenla, JA New arylpiperazine derivatives with high affinity for alpha1A, D2 and 5-HT2A receptors. Bioorg Med Chem Lett 13:175-8 (2002)  
Target
Name:
D(2) dopamine receptor
Synonyms:
DOPAMINE D2 DOPAMINE D2 Short Dopamine D2 receptor Drd2
Type:
G Protein-Coupled Receptor (GPCR)
Mol. Mass.:
50931.60
Organism:
Rattus norvegicus (rat)
Description:
P61169
Residue:
444
  
Inhibitor
Name:
BDBM50404047
Synonyms:
CHEMBL52384
Type:
Small organic molecule
Emp. Form.:
C21H24N4O4
Mol. Mass.:
396.4397
SMILES:
COc1cc(=O)oc2cc(OCCCN3CCN(CC3)c3ncccn3)ccc12
: