Target
D(2) dopamine receptor
Ligand
BDBM50404053
Substrate
Meas. Tech.
ChEBML_60942
Ki
12±n/a nM
Citation
 González-Gómez, JCSantana, LUriarte, EBrea, JVillazón, MLoza, MIDe Luca, MRivas, MEMontenegro, GYFontenla, JA New arylpiperazine derivatives with high affinity for alpha1A, D2 and 5-HT2A receptors. Bioorg Med Chem Lett 13:175-8 (2002)  
Target
Name:
D(2) dopamine receptor
Synonyms:
DOPAMINE D2 DOPAMINE D2 Short Dopamine D2 receptor Drd2
Type:
G Protein-Coupled Receptor (GPCR)
Mol. Mass.:
50931.60
Organism:
Rattus norvegicus (rat)
Description:
P61169
Residue:
444
  
Inhibitor
Name:
BDBM50404053
Synonyms:
CHEMBL51767
Type:
Small organic molecule
Emp. Form.:
C24H28N2O4
Mol. Mass.:
408.4901
SMILES:
COc1ccccc1N1CCN(CCCOc2ccc3c(C)cc(=O)oc3c2)CC1
: