Target
5-hydroxytryptamine receptor 2A
Ligand
BDBM50404050
Substrate
Meas. Tech.
ChEBML_2422
Ki
3090±n/a nM
Citation
 González-Gómez, JCSantana, LUriarte, EBrea, JVillazón, MLoza, MIDe Luca, MRivas, MEMontenegro, GYFontenla, JA New arylpiperazine derivatives with high affinity for alpha1A, D2 and 5-HT2A receptors. Bioorg Med Chem Lett 13:175-8 (2002)  
Target
Name:
5-hydroxytryptamine receptor 2A
Synonyms:
5-HT-2A 5-HT2A 5-hydroxytryptamine receptor 2A (5HT2A) Htr2 Serotonin Receptor 2A
Type:
G Protein-Coupled Receptor (GPCR)
Mol. Mass.:
52852.05
Organism:
Rattus norvegicus (rat)
Description:
Rat cortex membranes 5-HT2A receptors.
Residue:
471
  
Inhibitor
Name:
BDBM50404050
Synonyms:
CHEMBL298108
Type:
Small organic molecule
Emp. Form.:
C24H28N2O5
Mol. Mass.:
424.4895
SMILES:
COc1ccccc1N1CCN(CCCOc2ccc3c(OC)cc(=O)oc3c2)CC1
: