Target
Inosine-5'-monophosphate dehydrogenase
Ligand
BDBM50366995
Substrate
Meas. Tech.
ChEBML_89668
Ki
236000±n/a nM
Citation
 Skibo, EBMeyer, RB Inhibition of inosinic acid dehydrogenase by 8-substituted purine nucleotides. J Med Chem 24:1155-61 (1982)  
Target
Name:
Inosine-5'-monophosphate dehydrogenase
Synonyms:
IMDH_ECOLI guaR
Type:
PROTEIN
Mol. Mass.:
52020.85
Organism:
Escherichia coli (strain K12)
Description:
ChEMBL_89670
Residue:
488
  
Inhibitor
Name:
BDBM50366995
Synonyms:
CHEMBL604968
Type:
Small organic molecule
Emp. Form.:
C17H20N5O8P
Mol. Mass.:
453.3432
SMILES:
O[C@@H]1[C@@H](COP(O)(O)=O)OC([C@@H]1O)n1c(NCc2ccccc2)nc2c1nc[nH]c2=O
: