Target
Inosine-5'-monophosphate dehydrogenase
Ligand
BDBM50367012
Substrate
Meas. Tech.
ChEBML_89668
Ki
17000±n/a nM
Citation
 Skibo, EBMeyer, RB Inhibition of inosinic acid dehydrogenase by 8-substituted purine nucleotides. J Med Chem 24:1155-61 (1982)  
Target
Name:
Inosine-5'-monophosphate dehydrogenase
Synonyms:
IMDH_ECOLI guaR
Type:
PROTEIN
Mol. Mass.:
52020.85
Organism:
Escherichia coli (strain K12)
Description:
ChEMBL_89670
Residue:
488
  
Inhibitor
Name:
BDBM50367012
Synonyms:
CHEMBL606055
Type:
Small organic molecule
Emp. Form.:
C17H18ClN6O9PS
Mol. Mass.:
548.851
SMILES:
Nc1ncnc2n(C3OC(CO[P+](O)(O)[O-])C(O)C3O)c(SCc3ccc(cc3Cl)[N+]([O-])=O)nc12
: