Target
Neutrophil elastase
Ligand
BDBM50406193
Substrate
Meas. Tech.
ChEMBL_21101 (CHEMBL633695)
Ki
1E3±n/a nM
KOFF
7.586E-3 s-1
KON
6.918E3 M-1s-1
Citation
 Krantz, ASpencer, RWTam, TFLiak, TJCopp, LJThomas, EMRafferty, SP Design and synthesis of 4H-3,1-benzoxazin-4-ones as potent alternate substrate inhibitors of human leukocyte elastase. J Med Chem 33:464-79 (1990)  
Target
Name:
Neutrophil elastase
Synonyms:
Bone marrow serine protease Coagulation factor X ELANE Elastase HLE Leukocyte elastase Medullasin Neutrophil elastase (HNE) PMN elastase Trypsin
Type:
Enzyme
Mol. Mass.:
28532.38
Organism:
Homo sapiens (Human)
Description:
P08246
Residue:
267
  
Inhibitor
Name:
BDBM50406193
Synonyms:
CHEMBL142534
Type:
Small organic molecule
Emp. Form.:
C14H13N3O4S
Mol. Mass.:
319.336
SMILES:
COc1cc2nc(SCc3cnc[nH]3)oc(=O)c2cc1OC
: