Target
Gag-Pol polyprotein [588-1027]/[588-1147]
Ligand
BDBM2257
Substrate
(poly)rC:(oligo)dG
Meas. Tech.
ChEMBL_195671 (CHEMBL800744)
IC50
11±n/a nM
Citation
 Hoffman, JMSmith, AMRooney, CSFisher, TEWai, JSThomas, CMBamberger, DLBarnes, JLWilliams, TMJones, JH Synthesis and evaluation of 2-pyridinone derivatives as HIV-1-specific reverse transcriptase inhibitors. 4. 3-[2-(Benzoxazol-2-yl)ethyl]-5-ethyl-6-methylpyridin-2(1H)-one and analogues. J Med Chem 36:953-66 (1993)  
Target
Name:
Gag-Pol polyprotein [588-1027]/[588-1147]
Synonyms:
EC: 2.7.7.49 | HIV-1 Reverse Transcriptase
Type:
Protein Complex
Mol. Mass.:
115684
Description:
Components:
This complex has 2 components.
Component 1
Name:
Gag-Pol polyprotein [588-1147]
Synonyms:
HIV-1 Reverse Transcriptase Chain A gag-pol
Type:
Enzyme Subunit
Mol. Mass.:
64486.41
Organism:
Human immunodeficiency virus type 1
Description:
P04585[588-1147]
Residue:
560
  
Component 2
Name:
Gag-Pol polyprotein [588-1027]
Synonyms:
HIV-1 Reverse Transcriptase Chain B gag-pol
Type:
Enzyme Subunit
Mol. Mass.:
51337.13
Organism:
Human immunodeficiency virus type 1
Description:
P04585[588-1027]
Residue:
440
  
Inhibitor
Name:
BDBM2257
Synonyms:
2-Pyridinone derivative 37 3-{[(4,7-dichloro-1,3-benzoxazol-2-yl)methyl]sulfanyl}-5-ethyl-6-methyl-1,2-dihydropyridin-2-one | CHEMBL171919
Type:
Small organic molecule
Emp. Form.:
C16H14Cl2N2O2S
Mol. Mass.:
369.266
SMILES:
CCc1cc(SCc2nc3c(Cl)ccc(Cl)c3o2)c(=O)[nH]c1C
:
Substrate
Name:
(poly)rC:(oligo)dG
Synonyms:
Type:
RNA-DNA duplex
Mol. Mass.:
358.43
Organism:
Description:
The incorporation of Tritium-labeled [3H]dGTP onto a (poly)rC:(oligo)dG template:primer.
Residue:
3
NA