Target
Angiotensin-converting enzyme
Ligand
BDBM50348866
Substrate
Meas. Tech.
ChEMBL_36008 (CHEMBL858254)
IC50
416869±n/a nM
Citation
 Collantes, ERDunn, WJ Amino acid side chain descriptors for quantitative structure-activity relationship studies of peptide analogues. J Med Chem 38:2705-13 (1995)  
Target
Name:
Angiotensin-converting enzyme
Synonyms:
ACE Angiotensin converting enzyme (ACE) Angiotensin-converting enzyme, soluble form CD_antigen=CD143 DCP1 Kininase II
Type:
Enzyme
Mol. Mass.:
149709.01
Organism:
Homo sapiens (Human)
Description:
Residue:
1306
  
Inhibitor
Name:
BDBM50348866
Synonyms:
CHEMBL439762
Type:
Small organic molecule
Emp. Form.:
C10H18N2O3
Mol. Mass.:
214.2615
SMILES:
CC(C)[C@H](N)C(=O)N1CCC[C@H]1C(O)=O
: