Target
Angiotensin-converting enzyme
Ligand
BDBM50407435
Substrate
Meas. Tech.
ChEMBL_36008 (CHEMBL858254)
IC50
3235936.57±n/a nM
Citation
 Collantes, ERDunn, WJ Amino acid side chain descriptors for quantitative structure-activity relationship studies of peptide analogues. J Med Chem 38:2705-13 (1995)  
Target
Name:
Angiotensin-converting enzyme
Synonyms:
ACE Angiotensin converting enzyme (ACE) Angiotensin-converting enzyme, soluble form CD_antigen=CD143 DCP1 Kininase II
Type:
Enzyme
Mol. Mass.:
149709.01
Organism:
Homo sapiens (Human)
Description:
Residue:
1306
  
Inhibitor
Name:
BDBM50407435
Synonyms:
CHEMBL90260
Type:
Small organic molecule
Emp. Form.:
C12H20N4O3
Mol. Mass.:
268.3122
SMILES:
CC(C)C[C@H](NC(=O)[C@@H](N)Cc1cnc[nH]1)C(O)=O
: