Target
Acetylcholinesterase
Ligand
BDBM9395
Substrate
Meas. Tech.
ChEMBL_28928 (CHEMBL857056)
IC50
84.92±n/a nM
Citation
 Tong, WCollantes, ERChen, YWelsh, WJ A comparative molecular field analysis study of N-benzylpiperidines as acetylcholinesterase inhibitors. J Med Chem 39:380-7 (1996)  
Target
Name:
Acetylcholinesterase
Synonyms:
ACES_MOUSE Acetylcholinesterase (mouse AChE) Ache
Type:
Enzyme
Mol. Mass.:
68165.65
Organism:
Mus musculus (mouse)
Description:
Residue:
614
  
Inhibitor
Name:
BDBM9395
Synonyms:
CHEMBL56706 Piperidine Derivative 3k
Type:
Small organic molecule
Emp. Form.:
C21H25FN2O
Mol. Mass.:
340.4344
SMILES:
Fc1ccc(cc1)C(=O)NCCC1CCN(Cc2ccccc2)CC1
: