Target
Acetylcholinesterase
Ligand
BDBM9399
Substrate
Meas. Tech.
ChEMBL_28928 (CHEMBL857056)
IC50
69.02±n/a nM
Citation
 Tong, WCollantes, ERChen, YWelsh, WJ A comparative molecular field analysis study of N-benzylpiperidines as acetylcholinesterase inhibitors. J Med Chem 39:380-7 (1996)  
Target
Name:
Acetylcholinesterase
Synonyms:
ACES_MOUSE Acetylcholinesterase (mouse AChE) Ache
Type:
Enzyme
Mol. Mass.:
68165.65
Organism:
Mus musculus (mouse)
Description:
Residue:
614
  
Inhibitor
Name:
BDBM9399
Synonyms:
CHEMBL299313 Piperidine Derivative 3o
Type:
Small organic molecule
Emp. Form.:
C20H25N3O
Mol. Mass.:
323.432
SMILES:
O=C(NCCC1CCN(Cc2ccccc2)CC1)c1cccnc1
: