Target
Amine oxidase [flavin-containing] A
Ligand
BDBM50409104
Substrate
Meas. Tech.
ChEMBL_123580 (CHEMBL732300)
IC50
691.83±n/a nM
Citation
 Gnerre, CCatto, MLeonetti, FWeber, PCarrupt, PAAltomare, CCarotti, ATesta, B Inhibition of monoamine oxidases by functionalized coumarin derivatives: biological activities, QSARs, and 3D-QSARs. J Med Chem 43:4747-58 (2000)  
Target
Name:
Amine oxidase [flavin-containing] A
Synonyms:
AOFA_RAT Amine oxidase [flavin-containing] A Monoamine Oxidase Type A (MAO-A) Monoamine oxidase A (MAO-A) Monoamine oxidase type A (MAOA)
Type:
Enzyme
Mol. Mass.:
59515.21
Organism:
Rattus norvegicus (rat)
Description:
Residue:
526
  
Inhibitor
Name:
BDBM50409104
Synonyms:
CHEMBL357614
Type:
Small organic molecule
Emp. Form.:
C18H11F5O3
Mol. Mass.:
370.2702
SMILES:
Cc1c(C)c(=O)oc2cc(OCc3c(F)c(F)c(F)c(F)c3F)ccc12
: