Target
Amine oxidase [flavin-containing] B
Ligand
BDBM50409104
Substrate
Meas. Tech.
ChEMBL_124418 (CHEMBL733082)
IC50
5.89±n/a nM
Citation
 Gnerre, CCatto, MLeonetti, FWeber, PCarrupt, PAAltomare, CCarotti, ATesta, B Inhibition of monoamine oxidases by functionalized coumarin derivatives: biological activities, QSARs, and 3D-QSARs. J Med Chem 43:4747-58 (2000)  
Target
Name:
Amine oxidase [flavin-containing] B
Synonyms:
AOFB_RAT Amine oxidase [flavin-containing] B Monoamine Oxidase Type B (MAO-B) Monoamine oxidase B (MAO-B) Monoamine oxidase type B (MAOB) | Monoamine oxidase-B (MAO-B)
Type:
Enzyme
Mol. Mass.:
58469.65
Organism:
Rattus norvegicus (rat)
Description:
P19643
Residue:
520
  
Inhibitor
Name:
BDBM50409104
Synonyms:
CHEMBL357614
Type:
Small organic molecule
Emp. Form.:
C18H11F5O3
Mol. Mass.:
370.2702
SMILES:
Cc1c(C)c(=O)oc2cc(OCc3c(F)c(F)c(F)c(F)c3F)ccc12
: