Target
5-hydroxytryptamine receptor 1D
Ligand
BDBM50090528
Substrate
Meas. Tech.
ChEMBL_1755 (CHEMBL616541)
Ki
<10000±n/a nM
Citation
 Riemer, CBorroni, ELevet-Trafit, BMartin, JRPoli, SPorter, RHBös, M Influence of the 5-HT6 receptor on acetylcholine release in the cortex: pharmacological characterization of 4-(2-bromo-6-pyrrolidin-1-ylpyridine-4-sulfonyl)phenylamine, a potent and selective 5-HT6 receptor antagonist. J Med Chem 46:1273-6 (2003)  
Target
Name:
5-hydroxytryptamine receptor 1D
Synonyms:
5-HT-1D 5-HT1D 5HT1D_HUMAN HTR1DA Serotonin (5-HT) receptor | Serotonin Receptor 1D
Type:
G Protein-Coupled Receptor (GPCR)
Mol. Mass.:
41920.63
Organism:
Homo sapiens (Human)
Description:
Receptor binding assays were performed using human clone stably expressed in CHO cells.
Residue:
377
  
Inhibitor
Name:
BDBM50090528
Synonyms:
4-Amino-N-(2,6-bis-dimethylamino-pyrimidin-4-yl)-benzenesulfonamide 4-Amino-N-(2-methylamino-pyrimidin-4-yl)-benzenesulfonamide CHEMBL433461 Ro 04-6790 | Ro-04-6790
Type:
Small organic molecule
Emp. Form.:
C12H16N6O2S
Mol. Mass.:
308.359
SMILES:
CNc1cc(NS(=O)(=O)c2ccc(N)cc2)nc(NC)n1
: