Target
5-hydroxytryptamine receptor 1D
Ligand
BDBM50001523
Substrate
Meas. Tech.
ChEMBL_1754 (CHEMBL616861)
Ki
<10000±n/a nM
Citation
 Riemer, CBorroni, ELevet-Trafit, BMartin, JRPoli, SPorter, RHBös, M Influence of the 5-HT6 receptor on acetylcholine release in the cortex: pharmacological characterization of 4-(2-bromo-6-pyrrolidin-1-ylpyridine-4-sulfonyl)phenylamine, a potent and selective 5-HT6 receptor antagonist. J Med Chem 46:1273-6 (2003)  
Target
Name:
5-hydroxytryptamine receptor 1D
Synonyms:
5-HT-1D 5-HT1D 5HT1D_HUMAN HTR1DA Serotonin (5-HT) receptor | Serotonin Receptor 1D
Type:
G Protein-Coupled Receptor (GPCR)
Mol. Mass.:
41920.63
Organism:
Homo sapiens (Human)
Description:
Receptor binding assays were performed using human clone stably expressed in CHO cells.
Residue:
377
  
Inhibitor
Name:
BDBM50001523
Synonyms:
CHEMBL23575
Type:
Small organic molecule
Emp. Form.:
C12H12BrN3O2S
Mol. Mass.:
342.212
SMILES:
CNc1cc(cc(Br)n1)S(=O)(=O)c1ccc(N)cc1
: