Target
5-hydroxytryptamine receptor 6
Ligand
BDBM50001524
Substrate
Meas. Tech.
ChEMBL_3645 (CHEMBL620782)
Ki
0.11±n/a nM
Citation
 Riemer, CBorroni, ELevet-Trafit, BMartin, JRPoli, SPorter, RHBös, M Influence of the 5-HT6 receptor on acetylcholine release in the cortex: pharmacological characterization of 4-(2-bromo-6-pyrrolidin-1-ylpyridine-4-sulfonyl)phenylamine, a potent and selective 5-HT6 receptor antagonist. J Med Chem 46:1273-6 (2003)  
Target
Name:
5-hydroxytryptamine receptor 6
Synonyms:
5-HT-6 5-hydroxytryptamine receptor 6 (5-HT-6) 5-hydroxytryptamine receptor 6 (5HT6) HTR6 Serotonin 6 (5-HT6) receptor | Serotonin Receptor 6
Type:
G Protein-Coupled Receptor (GPCR)
Mol. Mass.:
46968.43
Organism:
Homo sapiens (Human)
Description:
P50406
Residue:
440
  
Inhibitor
Name:
BDBM50001524
Synonyms:
CHEMBL24474
Type:
Small organic molecule
Emp. Form.:
C15H17BrN4O2S
Mol. Mass.:
397.29
SMILES:
Nc1ccc(cc1)S(=O)(=O)c1cc(Br)nc(c1)N1CCNCC1
: