Target
Sodium-dependent serotonin transporter
Ligand
BDBM50024206
Substrate
Meas. Tech.
ChEMBL_312698 (CHEMBL834018)
IC50
1200±n/a nM
Citation
 Schmitz, WDDenhart, DJBrenner, ABDitta, JLMattson, RJMattson, GKMolski, TFMacor, JE Homotryptamines as potent and selective serotonin reuptake inhibitors (SSRIs). Bioorg Med Chem Lett 15:1619-21 (2005)  
Target
Name:
Sodium-dependent serotonin transporter
Synonyms:
5-HT Transporter 5HTT SC6A4_HUMAN SLC6A4 Serotonin transporter (5HTT) Sodium-dependent serotonin transporter (SERT) | Solute carrier family 6 member 4
Type:
Multi-pass membrane protein
Mol. Mass.:
70322.51
Organism:
Homo sapiens (Human)
Description:
P31645
Residue:
630
  
Inhibitor
Name:
BDBM50024206
Synonyms:
3-[2-(dimethylamino)ethyl]-1H-indol-5-ol 3-[2-(dimethylamino)ethyl]indol-5-ol 5-hydroxy-N,N-dimethyltryptamine Bufotenine DM5-HT N,N-dimethylserotonin
Type:
Small organic molecule
Emp. Form.:
C12H16N2O
Mol. Mass.:
204.2682
SMILES:
CN(C)CCc1c[nH]c2ccc(O)cc12
: