Target
Melanocortin receptor 3
Ligand
BDBM50410241
Substrate
Meas. Tech.
ChEMBL_307548 (CHEMBL831261)
EC50
1995±n/a nM
Citation
 Kruijtzer, JANijenhuis, WAWanders, NGispen, WHLiskamp, RMAdan, RA Peptoid-peptide hybrids as potent novel melanocortin receptor ligands. J Med Chem 48:4224-30 (2005)  
Target
Name:
Melanocortin receptor 3
Synonyms:
MC3-R MC3R_HUMAN Melanocortin receptor (M3 and M4)
Type:
Enzyme
Mol. Mass.:
36044.86
Organism:
Homo sapiens (Human)
Description:
P41968
Residue:
323
  
Inhibitor
Name:
BDBM50410241
Synonyms:
CHEMBL188459
Type:
Small organic molecule
Emp. Form.:
C44H65N13O8
Mol. Mass.:
904.0692
SMILES:
CCCCN(CC(=O)NCC(=O)N(CCCCN)CC(=O)N[C@H](Cc1ccccc1)C(=O)N[C@@H](CCCNC(N)=N)C(=O)N[C@@H](Cc1c[nH]c2ccccc12)C(=O)NCC(N)=O)C(C)=O
: