Target
Melanocortin receptor 4
Ligand
BDBM50410241
Substrate
Meas. Tech.
ChEMBL_307552 (CHEMBL831265)
IC50
63±n/a nM
Citation
 Kruijtzer, JANijenhuis, WAWanders, NGispen, WHLiskamp, RMAdan, RA Peptoid-peptide hybrids as potent novel melanocortin receptor ligands. J Med Chem 48:4224-30 (2005)  
Target
Name:
Melanocortin receptor 4
Synonyms:
MC4-R MC4R_HUMAN Melanocortin receptor 4 (MC-4) Melanocortin receptor 4 (MC4R)
Type:
Enzyme
Mol. Mass.:
36949.50
Organism:
Homo sapiens (Human)
Description:
P32245
Residue:
332
  
Inhibitor
Name:
BDBM50410241
Synonyms:
CHEMBL188459
Type:
Small organic molecule
Emp. Form.:
C44H65N13O8
Mol. Mass.:
904.0692
SMILES:
CCCCN(CC(=O)NCC(=O)N(CCCCN)CC(=O)N[C@H](Cc1ccccc1)C(=O)N[C@@H](CCCNC(N)=N)C(=O)N[C@@H](Cc1c[nH]c2ccccc12)C(=O)NCC(N)=O)C(C)=O
: