Target
Androgen receptor
Ligand
BDBM8903
Substrate
Meas. Tech.
ChEMBL_321687 (CHEMBL872182)
IC50
1548.82±n/a nM
Citation
 Lill, MAWiniger, FVedani, AErnst, B Impact of induced fit on ligand binding to the androgen receptor: a multidimensional QSAR study to predict endocrine-disrupting effects of environmental chemicals. J Med Chem 48:5666-74 (2005)  
Target
Name:
Androgen receptor
Synonyms:
ANDR_RAT Ar Nr3c4 | androgen
Type:
Enzyme
Mol. Mass.:
98219.08
Organism:
Rattus norvegicus (Rat)
Description:
P15207
Residue:
902
  
Inhibitor
Name:
BDBM8903
Synonyms:
(1S,2R,10S,11S,14S,15S)-14-acetyl-2,15-dimethyltetracyclo[8.7.0.0^{2,7}.0^{11,15}]heptadec-6-en-5-one progesterone
Type:
Steroid
Emp. Form.:
C21H30O2
Mol. Mass.:
314.4617
SMILES:
[H][C@@]12CC[C@H](C(C)=O)[C@@]1(C)CC[C@@]1([H])[C@@]2([H])CCC2=CC(=O)CC[C@]12C
: