Target
Succinate dehydrogenase [ubiquinone] iron-sulfur subunit, mitochondrial
Ligand
BDBM50411095
Substrate
Meas. Tech.
ChEMBL_376968 (CHEMBL870330)
IC50
1815±n/a nM
Citation
 Bolgunas, SClark, DAHanna, WSMauvais, PAPember, SO Potent inhibitors of the Qi site of the mitochondrial respiration complex III. J Med Chem 49:4762-6 (2006)  
Target
Name:
Succinate dehydrogenase [ubiquinone] iron-sulfur subunit, mitochondrial
Synonyms:
Ip SDH2 | SDHB_ZYMTR
Type:
PROTEIN
Mol. Mass.:
33680.57
Organism:
Septoria tritici
Description:
ChEMBL_376968
Residue:
297
  
Inhibitor
Name:
BDBM50411095
Synonyms:
CHEMBL439507
Type:
Small organic molecule
Emp. Form.:
C20H13F3N4O3
Mol. Mass.:
414.3374
SMILES:
Oc1c(ccc2nn[nH]c12)C(=O)Nc1ccc(Oc2ccc(cc2)C(F)(F)F)cc1
: