Target
Succinate dehydrogenase [ubiquinone] iron-sulfur subunit, mitochondrial
Ligand
BDBM50411096
Substrate
Meas. Tech.
ChEMBL_376967 (CHEMBL870329)
IC50
26±n/a nM
Citation
 Bolgunas, SClark, DAHanna, WSMauvais, PAPember, SO Potent inhibitors of the Qi site of the mitochondrial respiration complex III. J Med Chem 49:4762-6 (2006)  
Target
Name:
Succinate dehydrogenase [ubiquinone] iron-sulfur subunit, mitochondrial
Synonyms:
Ip SDH2 | SDHB_ZYMTR
Type:
PROTEIN
Mol. Mass.:
33680.57
Organism:
Septoria tritici
Description:
ChEMBL_376968
Residue:
297
  
Inhibitor
Name:
BDBM50411096
Synonyms:
CHEMBL378123
Type:
Small organic molecule
Emp. Form.:
C19H12F3N3O3S
Mol. Mass.:
419.377
SMILES:
Oc1c(sc2c[nH]nc12)C(=O)Nc1ccc(Oc2ccc(cc2)C(F)(F)F)cc1
: