Target
Amine oxidase [flavin-containing] B
Ligand
BDBM50409104
Substrate
Meas. Tech.
ChEMBL_417161 (CHEMBL909462)
IC50
1.62±n/a nM
Citation
 Novaroli, LDaina, AFavre, EBravo, JCarotti, ALeonetti, FCatto, MCarrupt, PAReist, M Impact of species-dependent differences on screening, design, and development of MAO B inhibitors. J Med Chem 49:6264-72 (2006)  
Target
Name:
Amine oxidase [flavin-containing] B
Synonyms:
AOFB_HUMAN MAOB Monoamine oxidase type B (MAO B) Monoamine oxidase type B (MAOB)
Type:
Protein
Mol. Mass.:
58768.76
Organism:
Homo sapiens (Human)
Description:
P27338
Residue:
520
  
Inhibitor
Name:
BDBM50409104
Synonyms:
CHEMBL357614
Type:
Small organic molecule
Emp. Form.:
C18H11F5O3
Mol. Mass.:
370.2702
SMILES:
Cc1c(C)c(=O)oc2cc(OCc3c(F)c(F)c(F)c(F)c3F)ccc12
: